[ircd-ratbox] ircd-ratbox-2.1.0 compile problems (3 errors, 5 warnings)

Rachel Llorenna rachies at gmail.com
Fri Apr 22 11:20:34 UTC 2005


When compiling the contrib modules:
gcc -fPIC -DPIC -shared  -I../include -I../adns   -O0 -Wall -g
-DIRCD_PREFIX=\"/home/frequency/ratbox\" m_mkpasswd.c -o m_mkpasswd.so
In file included from m_mkpasswd.c:19:
../include/s_newconf.h:69: error: parse error before "patricia_node_t"
../include/s_newconf.h:69: warning: no semicolon at end of struct or union
../include/s_newconf.h:71: error: parse error before '}' token
../include/s_newconf.h:71: warning: type defaults to `int' in
declaration of `tgchange'
../include/s_newconf.h:71: warning: data definition has no type or storage class
../include/s_newconf.h:74: error: parse error before '*' token
../include/s_newconf.h:74: warning: type defaults to `int' in
declaration of `find_tgchange'
../include/s_newconf.h:74: warning: data definition has no type or storage class
make: *** [m_mkpasswd.so] Error 1

The package is version 2.1.0 under GCC 3.3.5 on GNU/Linux Debian using
the Linux 2.4.27-i686 kernel. According to include/serno.h, the serial
number is 20050318_0

 I'm not sure if this bug has been fixed in future versions...
-- 
Regards,

Rachel Llorenna (frequency)


More information about the ircd-ratbox mailing list